{"text_format":"1","workbook":"xlsx","n_sheets":12,"sheets":["DatosBasicos","Departamentos","EntidadesTerritoriales","DAF_BalanceFinancieroVA","DAF_Ley358","DAF_SaldoDeuda","Entidad","Descripción_Glosario","Supuestos Macro Nación","Plan Financiero","Superávit Primario","Capacidad de Endeudamiento"],"not_rendered":{"charts":0,"images":5,"macros":0,"external_links":4,"defined_names":113,"comments":1,"pivot_tables":0},"unopened":[],"bounds":{"document_bytes":16777216,"sheet_cells":100000,"rows_first":2000,"rows_last":500,"rows_between":2000,"halvings":0,"cell_chars":16384,"cell_head_chars":4096},"cells_cut":0,"cells_raw":0,"read":"whole","date_system":"1900"}

{"sheet":"DatosBasicos","index":0,"n_rows":11,"n_cols":4,"rows_kept":11,"cut":false,"hidden":true,"merged":[]}
["AÑO","DEPARTAMENTO","CORTE"]
[2018,"CAUCA"]
["SI"]
["NO",null,null,"% DE ICLD CONTRALORIAS DPTALES"]
["E","E",null,1.2E-2]
[1,1,null,0.02]
[2,2,null,2.5000000000000001E-2]
[3,3,null,0.03]
[4,4,null,0.03]
[null,5]
{"$rows_left_out":2}
{"sheet":"Departamentos","index":1,"n_rows":33,"n_cols":2,"rows_kept":33,"cut":false,"hidden":true,"merged":[]}
["NOMBRE_DEPARTAMENTO","CODIGO_DIVIPOLA_DEPARTAMENTO"]
["AMAZONAS",91000]
["ANTIOQUIA",5000]
["ARAUCA",81000]
["ATLANTICO",8000]
["BOLIVAR",13000]
["BOYACA",15000]
["CALDAS",17000]
["CAQUETA",18000]
["CASANARE",85000]
{"$rows_left_out":24}
{"sheet":"EntidadesTerritoriales","index":2,"n_rows":1134,"n_cols":5,"rows_kept":1134,"cut":false,"hidden":true,"merged":[]}
["CONCATENACION","DEPARTAMENTO","CODIGO_DIVIPOLA_ENTIDAD","NOMBRE_ENTIDAD","ESPECIAL"]
[{"$f":"B2&\"-\"&D2","v":"AMAZONAS-DEPARTAMENTO DEL AMAZONAS"},"AMAZONAS",91000,"DEPARTAMENTO DEL AMAZONAS",4]
[{"$f":"B3&\"-\"&D3","v":"AMAZONAS-LETICIA"},"AMAZONAS",91001,"LETICIA",6]
["AMAZONAS-PUERTO NARIÑO","AMAZONAS",91540,"PUERTO NARIÑO",6]
["ANTIOQUIA-ABEJORRAL","ANTIOQUIA",5002,"ABEJORRAL",6]
["ANTIOQUIA-ABRIAQUÍ","ANTIOQUIA",5004,"ABRIAQUÍ",6]
["ANTIOQUIA-ALEJANDRÍA","ANTIOQUIA",5021,"ALEJANDRÍA",6]
["ANTIOQUIA-AMAGÁ","ANTIOQUIA",5030,"AMAGÁ",6]
["ANTIOQUIA-AMALFI","ANTIOQUIA",5031,"AMALFI",6]
["ANTIOQUIA-ANDES","ANTIOQUIA",5034,"ANDES",6]
{"$rows_left_out":1125}
{"sheet":"DAF_BalanceFinancieroVA","index":3,"n_rows":3106,"n_cols":8,"rows_kept":3106,"cut":false,"hidden":true,"merged":[]}
["CONCATENACION","DEPARTAMENTO","CODIGO_DIVIPOLA_ENTIDAD","NOMBRE_ENTIDAD","ORDEN","CODIGO_CONCEPTO_BF","NOMBRE_CONCEPTO_BF","TOTAL"]
[{"$f":"C2&\"-\"&F2","v":"19022-BF_1"},"CAUCA",19022,"ALMAGUER",1,"BF_1","INGRESOS TOTALES",11867.259]
["19022-BF_1.1","CAUCA",19022,"ALMAGUER",2,"BF_1.1","    INGRESOS CORRIENTES",8913.0869999999995]
["19022-BF_1.1.1","CAUCA",19022,"ALMAGUER",3,"BF_1.1.1","        TRIBUTARIOS",614.02599999999995]
["19022-BF_1.1.1.1","CAUCA",19022,"ALMAGUER",4,"BF_1.1.1.1","             Vehículos Automotores",4.7610000000000001]
["19022-BF_1.1.1.2","CAUCA",19022,"ALMAGUER",5,"BF_1.1.1.2","             Impuesto Predial Unificado",80.813000000000002]
["19022-BF_1.1.1.3","CAUCA",19022,"ALMAGUER",6,"BF_1.1.1.3","             Impuesto de Industria y Comercio",119.57599999999999]
["19022-BF_1.1.1.8","CAUCA",19022,"ALMAGUER",11,"BF_1.1.1.8","             Sobretasa Consumo Gasolina Motor",17.271999999999998]
["19022-BF_1.1.1.9","CAUCA",19022,"ALMAGUER",12,"BF_1.1.1.9","             Estampillas",249.26400000000001]
["19022-BF_1.1.1.12","CAUCA",19022,"ALMAGUER",15,"BF_1.1.1.12","             Otros Ingresos Tributarios",142.34]
{"$rows_left_out":3097}
{"sheet":"DAF_Ley358","index":4,"n_rows":155,"n_cols":7,"rows_kept":155,"cut":false,"hidden":true,"merged":[]}
["CONCATENACION","DEPARTAMENTO","CODIGO_DIVIPOLA_ENTIDAD","NOMBRE_ENTIDAD","CODIGO_INDICADOR","NOMBRE_INDICADOR","TOTAL"]
[{"$f":"C2&\"-\"&E2","v":"19022-CAPEN.1.1"},"CAUCA",19022,"ALMAGUER","CAPEN.1.1","1.1 Ingresos corrientes (sin descontar vigencias futuras)",13849.50441]
["19022-CAPEN.2","CAUCA",19022,"ALMAGUER","CAPEN.2","2. Gastos de funcionamiento",3109.5727440000001]
["19050-CAPEN.1.1","CAUCA",19050,"ARGELIA - CAUCA","CAPEN.1.1","1.1 Ingresos corrientes (sin descontar vigencias futuras)",10580.547541]
["19050-CAPEN.2","CAUCA",19050,"ARGELIA - CAUCA","CAPEN.2","2. Gastos de funcionamiento",3999.030299]
["19075-CAPEN.1.1","CAUCA",19075,"BALBOA - CAUCA","CAPEN.1.1","1.1 Ingresos corrientes (sin descontar vigencias futuras)",7618.8271770000001]
["19075-CAPEN.2","CAUCA",19075,"BALBOA - CAUCA","CAPEN.2","2. Gastos de funcionamiento",2717.5190240000002]
["19075-CAPEN.4.1.1","CAUCA",19075,"BALBOA - CAUCA","CAPEN.4.1.1","4.1.1 Saldo de la deuda",1515.958629]
["19075-CAPEN.4.2.1","CAUCA",19075,"BALBOA - CAUCA","CAPEN.4.2.1","4.2.1 Amortizaciones de la deuda",206.577]
["19075-CAPEN.5.1","CAUCA",19075,"BALBOA - CAUCA","CAPEN.5.1","5.1 Intereses de la deuda",280.39455700000002]
{"$rows_left_out":146}
{"sheet":"DAF_SaldoDeuda","index":5,"n_rows":681,"n_cols":4,"rows_kept":681,"cut":false,"hidden":true,"merged":[]}
["DEPARTAMENTO","CODIGO_DIVIPOLA_ENTIDAD","NOMBRE_ENTIDAD","SALDO"]
["ANTIOQUIA",5002,"ABEJORRAL",282.37299999999999]
["ANTIOQUIA",5004,"ABRIAQUÍ",1288.0440000000001]
["ANTIOQUIA",5021,"ALEJANDRÍA",0.82699999999999996]
["ANTIOQUIA",5030,"AMAGÁ",2652.5320000000002]
["ANTIOQUIA",5031,"AMALFI",4924.3109999999997]
["ANTIOQUIA",5036,"ANGELÓPOLIS",190.292]
["ANTIOQUIA",5040,"ANORÍ",815.12900000000002]
["ANTIOQUIA",5044,"ANZÁ",338.90300000000002]
["ANTIOQUIA",5045,"APARTADÓ",22656.046999999999]
{"$rows_left_out":672}
{"sheet":"Entidad","index":6,"n_rows":20,"n_cols":2,"rows_kept":20,"cut":false,"hidden":false,"merged":[[2,0,2,1],[4,0,5,2],[19,0,19,2]]}
[]
[]
[]
[]
["FORMULACION PLAN FINANCIERO DEL MARCO FISCAL DE MEDIANO PLAZO"]
[]
[]
["Departamento:",{"$f":"DatosBasicos!B2","v":"CAUCA"}]
[]
["Entidad Territorial:"]
{"$rows_left_out":11}
{"sheet":"Descripción_Glosario","index":7,"n_rows":44,"n_cols":3,"rows_kept":44,"cut":false,"hidden":false,"merged":[[42,2,42,9],[43,2,43,9],[37,2,37,9],[38,2,38,9],[39,2,39,9],[40,2,40,9],[41,2,41,9],[27,2,27,9],[28,2,28,9],[29,2,29,9],[30,2,30,9],[31,2,31,9],[32,2,32,9],[33,2,33,9],[34,2,34,9],[35,2,35,9],[36,2,36,9],[2,0,2,10],[8,1,8,10],[18,2,18,9],[19,2,19,9],[20,2,20,9],[10,1,10,10],[11,1,11,10],[12,1,12,10],[13,1,13,10],[14,1,14,10],[5,1,5,10],[7,1,7,10],[6,1,6,10],[9,1,9,10],[15,1,15,10],[24,2,24,9],[25,2,25,9],[26,2,26,9],[21,2,21,9],[22,2,22,9],[23,2,23,9]]}
[]
[]
["Herramienta: Plan Financiero"]
[]
["1. Descripción Estructura de la Herramienta:"]
[null,"Hoja \"Histórico Deptos\" = Estructura del Plan Financiero formulado por el DNP que contiene la información de ingresos y gastos de las últimas cuatro (4) vigencias para el Departamento. Esta información permite evaluar las variaciones y composiciones y tomar estos datos como referencia para las proyecciones."]
[null,"Hoja \"Histórico Mpios\" = Estructura del Plan Financiero formulado por el DNP que contiene la información de ingresos y gastos de las últimas cuatro (4) vigencias para Municipios. Esta información permite evaluar las variaciones y composiciones y tomar estos datos como referencia para las proyecciones."]
[null,"Hoja \"Restricciones_Pptales_ET\" = Relación de las Restricciones Presupuestales de la Entidad Territorial, derivadas de la Ejecución de Programas de Saneamiento Fiscal, la aprobación de Vigencias Futuras, la existencia de pasivos ciertos y exigibles de vigencias anteriores y la determinación de los pasivos contingentes. Incluye la determinación de Ingresos Corrientes de Libre Destinación y límites del gasto."]
[null,"Hoja \"Ingresos\" = Contiene la información del Presupuesto Definitivo y los Recaudos de la Entidad Territorial, con corte al mes de Marzo de la vigencia, reportados a través del FUT.  La columna H de la hoja permite digitar, en cada una de las celdas resaltadas en amarillo, los valores proyectados de los recaudos que se obtendrán por cada concepto entre el mes de abril y diciembre de la vigencia. En la columna I se obtiene el total del ingreso proyectado para la vigencia. Finalmente, la columna J permite digitar, en cada una de las celdas resaltadas en amarillo, los valores del proyecto de presupuesto de ingresos para cada concepto en la siguiente vigencia."]
[null,"Hoja \"Gastos\" = Contiene la información del Presupuesto Definitivo y los Compromisos de la Entidad Territorial, con corte al mes de Marzo de la vigencia, reportados a través del FUT.  La columna E de la hoja permite digitar, en cada una de las celdas resaltadas en amarillo, los valores de los compromisos que se proyectan adquirir por cada concepto entre el mes de abril y diciembre de la vigencia. En la columna I se obtiene el total de los compromisos proyectados para la vigencia. Finalmente, la columna G permite digitar, en cada una de las celdas resaltadas en amarillo, los valores del proyecto de presupuesto de gastos para cada concepto en la siguiente vigencia."]
{"$rows_left_out":35}
{"sheet":"Supuestos Macro Nación","index":8,"n_rows":74,"n_cols":35,"rows_kept":74,"cut":false,"hidden":false,"merged":[]}
[null,null,"Fecha:",{"$f":"TODAY()","v":"2018-09-28"}]
["SUPUESTOS GENERALES BASICOS",null,null,null,1999,2000,2001,2002,2003,2004,2005,2006,2007,2008,2009,2010,2011,2012,2013,2014,2015,2016,2017,2018,2019,2020,2021,2022,2023,2024,2025,2026,2027,2028,2029]
[]
[]
[]
["INFLACION",null,null,null,null,null,null,null,null,null,null,null,null,1000]
[]
[null,"INFLACION DOMESTICA"]
[null,"   IPC fin de período",null,null,9.2316540745348128,8.7482000000000006,7.6483040097600652,6.9918404067033757,6.4913617953455738,5.4969828257933617,4.8551654166048674,4.4779483553561761,5.6944612269421713,7.6743713813311798,2.0018080000000049,3.1712222199041795,3.7266851825832337,2.44,1.94,3.66,6.77,5.75,4.09,3.3,3,3,3,3,3,3,3,3,3,3,3]
[null,"INFLACION EXTERNA"]
{"$rows_left_out":65}
{"sheet":"Plan Financiero","index":9,"n_rows":129,"n_cols":17,"rows_kept":129,"cut":false,"hidden":false,"merged":[[0,2,0,3],[1,2,1,3],[2,2,2,3]]}
[null,null,"BALANCE FINANCIERO DEPARTAMENTO"]
[null,null,{"$f":"+Entidad!B10","v":0}]
[null,null,"Valores en millones de pesos"]
["Tipo","Categoria FUT","Cuenta","Descripción",{"$f":"VALUE(DatosBasicos!A2)-1","v":2017},{"$f":"DatosBasicos!A2","v":2018},{"$f":"+Entidad!B14+1","v":2019},{"$f":"+G4+1","v":2020},{"$f":"+H4+1","v":2021},2022,2023,2024,2025,2026,2027,2028,2029]
["P","NA","BF_1","INGRESOS TOTALES",{"$f":"E6+E75","v":0},{"$f":"F6+F75","v":0},{"$f":"G6+G75","v":0},0,0,0,0,0,0,0,0,0,{"$f":"Q6+Q75","v":0}]
["P","NA","BF_1.1","    INGRESOS CORRIENTES",{"$f":"E7+E20+E23","v":0},{"$f":"F7+F20+F23","v":0},{"$f":"G7+G20+G23","v":0},0,0,0,0,0,0,0,0,0,{"$f":"Q7+Q20+Q23","v":0}]
["P","NA","BF_1.1.1","        TRIBUTARIOS",{"$f":"SUM(E8:E19)","v":0},{"$f":"SUM(F8:F19)","v":0},{"$f":"SUM(G8:G19)","v":0},0,0,0,0,0,0,0,0,0,{"$f":"SUM(Q8:Q19)","v":0}]
["H","INGRESOS","BF_1.1.1.1","             Vehículos Automotores",{"$f":"IFERROR(VLOOKUP(Entidad!$B$12&\"-\"&'Plan Financiero'!$C8,DAF_BalanceFinancieroVA!$A$2:$H$3106,8,FALSE),0)","v":0}]
["H","INGRESOS","BF_1.1.1.2","             Impuesto Predial Unificado",{"$f":"IFERROR(VLOOKUP(Entidad!$B$12&\"-\"&'Plan Financiero'!$C9,DAF_BalanceFinancieroVA!$A$2:$H$3106,8,FALSE),0)","v":0}]
["H","INGRESOS","BF_1.1.1.3","             Impuesto de Industria y Comercio",{"$f":"IFERROR(VLOOKUP(Entidad!$B$12&\"-\"&'Plan Financiero'!$C10,DAF_BalanceFinancieroVA!$A$2:$H$3106,8,FALSE),0)","v":0}]
{"$rows_left_out":120}
{"sheet":"Superávit Primario","index":10,"n_rows":15,"n_cols":14,"rows_kept":15,"cut":false,"hidden":false,"merged":[]}
[{"$f":"Entidad!B10","v":0}]
["METAS DEL SUPERAVIT PRIMARIO"]
["LEY 819 DE 2003 (millones de pesos)"]
["CONCEPTOS",{"$f":"+'Plan Financiero'!E4","v":2017},{"$f":"+'Plan Financiero'!F4","v":2018},{"$f":"+'Plan Financiero'!G4","v":2019},{"$f":"+'Plan Financiero'!H4","v":2020},{"$f":"+'Plan Financiero'!I4","v":2021},{"$f":"+'Plan Financiero'!J4","v":2022},{"$f":"+'Plan Financiero'!K4","v":2023},{"$f":"+'Plan Financiero'!L4","v":2024},{"$f":"+'Plan Financiero'!M4","v":2025},{"$f":"+'Plan Financiero'!N4","v":2026},{"$f":"+'Plan Financiero'!O4","v":2027},{"$f":"+'Plan Financiero'!P4","v":2028},{"$f":"+'Plan Financiero'!Q4","v":2029}]
["INGRESOS CORRIENTES",{"$f":"+'Plan Financiero'!E6","v":0},{"$f":"+'Plan Financiero'!F6","v":0},{"$f":"+'Plan Financiero'!G6","v":0},{"$f":"+'Plan Financiero'!H6","v":0},{"$f":"+'Plan Financiero'!I6","v":0},{"$f":"+'Plan Financiero'!J6","v":0},{"$f":"+'Plan Financiero'!K6","v":0},{"$f":"+'Plan Financiero'!L6","v":0},{"$f":"+'Plan Financiero'!M6","v":0},{"$f":"+'Plan Financiero'!N6","v":0},{"$f":"+'Plan Financiero'!O6","v":0},{"$f":"+'Plan Financiero'!P6","v":0},{"$f":"+'Plan Financiero'!Q6","v":0}]
["RECURSOS DE CAPITAL",{"$f":"+'Plan Financiero'!E75+'Plan Financiero'!E106","v":0},{"$f":"+'Plan Financiero'!F75+'Plan Financiero'!F106","v":0},{"$f":"+'Plan Financiero'!G75+'Plan Financiero'!G106","v":0},{"$f":"+'Plan Financiero'!H75+'Plan Financiero'!H106","v":0},{"$f":"+'Plan Financiero'!I75+'Plan Financiero'!I106","v":0},{"$f":"+'Plan Financiero'!J75+'Plan Financiero'!J106","v":0},{"$f":"+'Plan Financiero'!K75+'Plan Financiero'!K106","v":0},{"$f":"+'Plan Financiero'!L75+'Plan Financiero'!L106","v":0},{"$f":"+'Plan Financiero'!M75+'Plan Financiero'!M106","v":0},{"$f":"+'Plan Financiero'!N75+'Plan Financiero'!N106","v":0},{"$f":"+'Plan Financiero'!O75+'Plan Financiero'!O106","v":0},{"$f":"+'Plan Financiero'!P75+'Plan Financiero'!P106","v":0},{"$f":"+'Plan Financiero'!Q75+'Plan Financiero'!Q106","v":0}]
["GASTOS DE FUNCIONAMIENTO",{"$f":"+'Plan Financiero'!E49","v":0},{"$f":"+'Plan Financiero'!F49","v":0},{"$f":"+'Plan Financiero'!G49","v":0},{"$f":"+'Plan Financiero'!H49","v":0},{"$f":"+'Plan Financiero'!I49","v":0},{"$f":"+'Plan Financiero'!J49","v":0},{"$f":"+'Plan Financiero'!K49","v":0},{"$f":"+'Plan Financiero'!L49","v":0},{"$f":"+'Plan Financiero'!M49","v":0},{"$f":"+'Plan Financiero'!N49","v":0},{"$f":"+'Plan Financiero'!O49","v":0},{"$f":"+'Plan Financiero'!P49","v":0},{"$f":"+'Plan Financiero'!Q49","v":0}]
["GASTOS DE INVERSION",{"$f":"+'Plan Financiero'!E65+'Plan Financiero'!E87+SUM('Plan Financiero'!E63:E64)","v":0},{"$f":"+'Plan Financiero'!F65+'Plan Financiero'!F87+SUM('Plan Financiero'!F63:F64)","v":0},{"$f":"+'Plan Financiero'!G65+'Plan Financiero'!G87+SUM('Plan Financiero'!G63:G64)","v":0},{"$f":"+'Plan Financiero'!H65+'Plan Financiero'!H87+SUM('Plan Financiero'!H63:H64)","v":0},{"$f":"+'Plan Financiero'!I65+'Plan Financiero'!I87+SUM('Plan Financiero'!I63:I64)","v":0},{"$f":"+'Plan Financiero'!J65+'Plan Financiero'!J87+SUM('Plan Financiero'!J63:J64)","v":0},{"$f":"+'Plan Financiero'!K65+'Plan Financiero'!K87+SUM('Plan Financiero'!K63:K64)","v":0},{"$f":"+'Plan Financiero'!L65+'Plan Financiero'!L87+SUM('Plan Financiero'!L63:L64)","v":0},{"$f":"+'Plan Financiero'!M65+'Plan Financiero'!M87+SUM('Plan Financiero'!M63:M64)","v":0},{"$f":"+'Plan Financiero'!N65+'Plan Financiero'!N87+SUM('Plan Financiero'!N63:N64)","v":0},{"$f":"+'Plan Financiero'!O65+'Plan Financiero'!O87+SUM('Plan Financiero'!O63:O64)","v":0},{"$f":"+'Plan Financiero'!P65+'Plan Financiero'!P87+SUM('Plan Financiero'!P63:P64)","v":0},{"$f":"+'Plan Financiero'!Q65+'Plan Financiero'!Q87+SUM('Plan Financiero'!Q63:Q64)","v":0}]
["SUPERAVIT O DEFICIT PRIMARIO",{"$f":"+B5+B6-B7-B8","v":0},0,{"$f":"+D5+D6-D7-D8","v":0},0,0,0,0,0,0,0,0,0,{"$f":"+N5+N6-N7-N8","v":0}]
["INDICADOR (superavit primario / Intereses) > = 100%",{"$f":"IF(B14<>0,B9/(B14),IF(AND(B14=0,B9<0),0,0))","v":0},{"$f":"IF(C14<>0,C9/(C14),IF(AND(C14=0,C9<0),0,0))","v":0},0,0,0,0,0,0,0,0,0,0,{"$f":"IF(N14<>0,N9/(N14),IF(AND(N14=0,N9<0),0,0))","v":0}]
{"$rows_left_out":6}
{"sheet":"Capacidad de Endeudamiento","index":11,"n_rows":52,"n_cols":14,"rows_kept":52,"cut":false,"hidden":false,"merged":[[0,1,0,2],[1,1,1,2],[2,1,2,2],[2,3,2,13]]}
[null,"REFERENTE DE LA CAPACIDAD DE ENDEUDAMIENTO",null,"IPC PROYECTADO"]
[null,{"$f":"Entidad!B10","v":0},null,{"$f":"+'Supuestos Macro Nación'!Y9/100","v":0.03},{"$f":"+'Supuestos Macro Nación'!Z9/100","v":0.03},{"$f":"+'Supuestos Macro Nación'!AA9/100","v":0.03},{"$f":"+'Supuestos Macro Nación'!AB9/100","v":0.03},{"$f":"+'Supuestos Macro Nación'!AC9/100","v":0.03},{"$f":"+'Supuestos Macro Nación'!AD9/100","v":0.03},{"$f":"+'Supuestos Macro Nación'!AE9/100","v":0.03},{"$f":"+'Supuestos Macro Nación'!AF9/100","v":0.03},{"$f":"+'Supuestos Macro Nación'!AG9/100","v":0.03},{"$f":"+'Supuestos Macro Nación'!AH9/100","v":0.03},{"$f":"+'Supuestos Macro Nación'!AI9/100","v":0.03}]
[null,"Valores en millones de pesos",null,"PROYECCION CAPACIDAD LEGAL DE ENDEUDAMIENTO - LEY 358 DE 1997"]
[null,"Concepto",{"$f":"\"Capacidad de endeudamiento (Ley 358/97)       \"&Entidad!B14","v":"Capacidad de endeudamiento (Ley 358/97)       2018"},{"$f":"+Entidad!B14+1","v":2019},{"$f":"+D4+1","v":2020},{"$f":"+E4+1","v":2021},2022,2023,2024,2025,2026,2027,2028,2029]
[null,"1. Ingresos corrientes Ley 358 de 1997 (1.1-1.2)",{"$f":"C6-C7","v":0},{"$f":"D6-D7","v":0},0,0,0,0,0,0,0,0,0,{"$f":"N6-N7","v":0}]
["CAPEN.1.1","    1.1 Ingresos corrientes (sin descontar vigencias futuras)",{"$f":"IFERROR(VLOOKUP(Entidad!$B$12&\"-\"&'Capacidad de Endeudamiento'!$A6,DAF_Ley358!$A$2:$G$155,7,FALSE),0)","v":0},{"$f":"+C6*(1+D2)","v":0},{"$f":"+D6*(1+E2)","v":0},0,0,0,0,0,0,0,0,0]
["CAPEN.1.2","    1.2 Vigencias futuras",{"$f":"IFERROR(VLOOKUP(Entidad!$B$12&\"-\"&'Capacidad de Endeudamiento'!$A7,DAF_Ley358!$A$2:$G$155,7,FALSE),0)","v":0}]
["CAPEN.2","2. Gastos de funcionamiento",{"$f":"IFERROR(VLOOKUP(Entidad!$B$12&\"-\"&'Capacidad de Endeudamiento'!$A8,DAF_Ley358!$A$2:$G$155,7,FALSE),0)","v":0},{"$f":"+C8*(1+D2)","v":0},{"$f":"+D8*(1+E2)","v":0},0,0,0,0,0,0,0,0,0]
[null,"3. Ahorro operacional (1-2)",{"$f":"C5-C8","v":0},{"$f":"D5-D8","v":0},0,0,0,0,0,0,0,0,0,{"$f":"N5-N8","v":0}]
[null,"4. Saldo neto de la deuda con nuevo crédito (4.1-4.2-4.3+4.4)",{"$f":"C11-C16-C20+C21","v":0},0,0,0,0,0,0,0,0,0,0,{"$f":"N11-N16-N20+N21","v":0}]
{"$rows_left_out":42}