{"text_format":"1","workbook":"xlsx","n_sheets":5,"sheets":["Control","Flujo","Resultados","Varios","Instructivo"],"not_rendered":{"charts":2,"images":2,"macros":1,"external_links":0,"defined_names":1,"comments":1,"pivot_tables":0},"unopened":[],"bounds":{"document_bytes":16777216,"sheet_cells":100000,"rows_first":2000,"rows_last":500,"rows_between":2000,"halvings":0,"cell_chars":16384,"cell_head_chars":4096},"cells_cut":0,"cells_raw":0,"read":"whole","date_system":"1900"}

{"sheet":"Control","index":0,"n_rows":30,"n_cols":10,"rows_kept":30,"cut":false,"hidden":false,"merged":[[26,2,26,3],[6,5,6,8],[14,5,14,8],[14,2,14,3],[18,5,18,9],[20,2,20,3]]}
[]
[]
[]
[]
[]
[]
[null,null,"Tipo de Infraestructura","Social",null,"Inversiones Etapa Construcción (Mill. COP)"]
[null,null,"Tipo de Proyecto","Greenfield",null,"Año","Infraestructura","Equipos","Total"]
[null,null,"Aprobación Diseños","Si",null,{"$f":"IF($D$10>=1,1,\"\")","v":1},30290,0,{"$f":"IF(F9=\"\",\"\",G9+H9)","v":30290}]
[null,null,"Etapa Construcción",2,null,{"$f":"IF($D$10>=2,2,\"\")","v":2},104218,0,{"$f":"IF(F10=\"\",\"\",G10+H10)","v":104218}]
[null,null,"Etapa Operativa",8,null,{"$f":"IF($D$10>=3,3,\"\")","v":""},null,null,""]
[null,null,"Total APP",{"$f":"IF(D9=\"Si\",1,0)+D10+D11","v":11},null,{"$f":"IF($D$10>=4,4,\"\")","v":""},null,null,""]
[null,null,null,null,null,{"$f":"IF($D$10>=5,5,\"\")","v":""},null,null,""]
[]
[null,null,"Endeudamiento Largo Plazo",null,null,"Inversiones Etapa Aprobación Diseños (Mill. COP)"]
[null,null,"Plazo Deuda Inicial",{"$f":"IF(D12>10,10,D12-1)","v":10},null,"Año","Infraestructura","Equipos","Total"]
[null,null,"Plazo Máximo",10,null,1,12435,0,{"$f":"G17+H17","v":12435}]
[null,null,"Período Máximo de Gracia",0]
[null,null,"Spread Deuda (DTF+%)",0.05,null,"Tipificación de Riesgos Previsibles"]
[null,null,null,null,null,"Tipo","Asignación","% Público","Probabilidad","Impacto"]
{"$rows_left_out":11}
{"sheet":"Flujo","index":1,"n_rows":116,"n_cols":74,"rows_kept":116,"cut":false,"hidden":true,"merged":[]}
[]
[]
[]
[]
[]
[null,"Tipo Infraestructura","Márgen EBITDA","Ke","WACC",null,"Equity",0.2,null,"VPN",{"$f":"NPV(VLOOKUP(Control!D7,Flujo!B7:D8,3,FALSE),D69:AG69)","v":9.6908228568218903E-12}]
[null,"Productiva",0.9,{"$f":"(1+15%)/(1+H9)-1","v":0.11650485436893199},{"$f":"$H$6*D7+(1-$H$6)*((1+$H$10)/(1+$H$9)-1)*(1-0.33)","v":6.3214757281553402E-2},null,"Primer Pago",{"$f":"IF(Control!D9=\"No\",0,1)+Control!D10+1","v":4}]
[null,"Social",0.9,{"$f":"(1+16%)/(1+H9)-1","v":0.12621359223300965},{"$f":"$H$6*D8+(1-$H$6)*((1+$H$10)/(1+$H$9)-1)*(1-0.33)","v":6.5156504854368941E-2},null,"Ingreso Inicial",41970.486868428459]
[null,null,null,null,null,null,"Inflación Prom",0.03]
[null,null,null,null,null,null,"Costo Deuda",{"$f":"(1+H9*1.8)*(1+Control!D19)-1","v":0.10670000000000002}]
[null,null,null,null,null,null,"Gracia",{"$f":"IF(Control!D18=0,0,IF(AND(Control!D18=1,Control!D11>=2),Control!D18,IF(AND(Control!D18=2,Control!D11>=3),Control!D18,0)))","v":0}]
[]
[null,null,null,1,2,3,4,5,6,7,8,9,10,11,12,13,14,15,16,17,18,19,20,21,22,23,24,25,26,27,28,29,30]
[]
[null," --- Balance General"]
[null,"Activo"]
[null,"Activo Corriente",null,{"$f":"IF(D13<=Control!$D$12,D18+D19,\"\")","v":0},{"$f":"IF(E13<=Control!$D$12,E18+E19,\"\")","v":3.637978807091713E-12},{"$f":"IF(F13<=Control!$D$12,F18+F19,\"\")","v":1.4551915228366852E-11},{"$f":"IF(G13<=Control!$D$12,G18+G19,\"\")","v":8863.3284259149877},{"$f":"IF(H13<=Control!$D$12,H18+H19,\"\")","v":18831.546558507009},{"$f":"IF(I13<=Control!$D$12,I18+I19,\"\")","v":28136.303767439822},{"$f":"IF(J13<=Control!$D$12,J18+J19,\"\")","v":38497.708183344323},{"$f":"IF(K13<=Control!$D$12,K18+K19,\"\")","v":50322.247135178906},{"$f":"IF(L13<=Control!$D$12,L18+L19,\"\")","v":63232.927538135395},{"$f":"IF(M13<=Control!$D$12,M18+M19,\"\")","v":77229.749392213809},{"$f":"IF(N13<=Control!$D$12,N18+N19,\"\")","v":18516.025982564515},{"$f":"IF(O13<=Control!$D$12,O18+O19,\"\")","v":""},{"$f":"IF(P13<=Control!$D$12,P18+P19,\"\")","v":""},{"$f":"IF(Q13<=Control!$D$12,Q18+Q19,\"\")","v":""},{"$f":"IF(R13<=Control!$D$12,R18+R19,\"\")","v":""},{"$f":"IF(S13<=Control!$D$12,S18+S19,\"\")","v":""},{"$f":"IF(T13<=Control!$D$12,T18+T19,\"\")","v":""},{"$f":"IF(U13<=Control!$D$12,U18+U19,\"\")","v":""},{"$f":"IF(V13<=Control!$D$12,V18+V19,\"\")","v":""},{"$f":"IF(W13<=Control!$D$12,W18+W19,\"\")","v":""},{"$f":"IF(X13<=Control!$D$12,X18+X19,\"\")","v":""},{"$f":"IF(Y13<=Control!$D$12,Y18+Y19,\"\")","v":""},{"$f":"IF(Z13<=Control!$D$12,Z18+Z19,\"\")","v":""},{"$f":"IF(AA13<=Control!$D$12,AA18+AA19,\"\")","v":""},{"$f":"IF(AB13<=Control!$D$12,AB18+AB19,\"\")","v":""},{"$f":"IF(AC13<=Control!$D$12,AC18+AC19,\"\")","v":""},{"$f":"IF(AD13<=Control!$D$12,AD18+AD19,\"\")","v":""},{"$f":"IF(AE13<=Control!$D$12,AE18+AE19,\"\")","v":""},{"$f":"IF(AF13<=Control!$D$12,AF18+AF19,\"\")","v":""},{"$f":"IF(AG13<=Control!$D$12,AG18+AG19,\"\")","v":""}]
[null,"Caja",null,{"$f":"IF(D13<=Control!$D$12,D64,\"\")","v":0},{"$f":"IF(E13<=Control!$D$12,E64,\"\")","v":3.637978807091713E-12},{"$f":"IF(F13<=Control!$D$12,F64,\"\")","v":1.4551915228366852E-11},{"$f":"IF(G13<=Control!$D$12,G64,\"\")","v":8863.3284259149877},{"$f":"IF(H13<=Control!$D$12,H64,\"\")","v":18831.546558507009},{"$f":"IF(I13<=Control!$D$12,I64,\"\")","v":28136.303767439822},{"$f":"IF(J13<=Control!$D$12,J64,\"\")","v":38497.708183344323},{"$f":"IF(K13<=Control!$D$12,K64,\"\")","v":50322.247135178906},{"$f":"IF(L13<=Control!$D$12,L64,\"\")","v":63232.927538135395},{"$f":"IF(M13<=Control!$D$12,M64,\"\")","v":77229.749392213809},{"$f":"IF(N13<=Control!$D$12,N64,\"\")","v":6411.2064949395863},{"$f":"IF(O13<=Control!$D$12,O64,\"\")","v":""},{"$f":"IF(P13<=Control!$D$12,P64,\"\")","v":""},{"$f":"IF(Q13<=Control!$D$12,Q64,\"\")","v":""},{"$f":"IF(R13<=Control!$D$12,R64,\"\")","v":""},{"$f":"IF(S13<=Control!$D$12,S64,\"\")","v":""},{"$f":"IF(T13<=Control!$D$12,T64,\"\")","v":""},{"$f":"IF(U13<=Control!$D$12,U64,\"\")","v":""},{"$f":"IF(V13<=Control!$D$12,V64,\"\")","v":""},{"$f":"IF(W13<=Control!$D$12,W64,\"\")","v":""},{"$f":"IF(X13<=Control!$D$12,X64,\"\")","v":""},{"$f":"IF(Y13<=Control!$D$12,Y64,\"\")","v":""},{"$f":"IF(Z13<=Control!$D$12,Z64,\"\")","v":""},{"$f":"IF(AA13<=Control!$D$12,AA64,\"\")","v":""},{"$f":"IF(AB13<=Control!$D$12,AB64,\"\")","v":""},{"$f":"IF(AC13<=Control!$D$12,AC64,\"\")","v":""},{"$f":"IF(AD13<=Control!$D$12,AD64,\"\")","v":""},{"$f":"IF(AE13<=Control!$D$12,AE64,\"\")","v":""},{"$f":"IF(AF13<=Control!$D$12,AF64,\"\")","v":""},{"$f":"IF(AG13<=Control!$D$12,AG64,\"\")","v":""}]
[null,"Dividendos Pagados por Anticipado",null,{"$f":"IF(D13<Control!$D$12,0,IF(D13=Control!$D$12,Flujo!D47,\"\"))","v":0},{"$f":"IF(E13<Control!$D$12,0,IF(E13=Control!$D$12,Flujo!E47,\"\"))","v":0},{"$f":"IF(F13<Control!$D$12,0,IF(F13=Control!$D$12,Flujo!F47,\"\"))","v":0},{"$f":"IF(G13<Control!$D$12,0,IF(G13=Control!$D$12,Flujo!G47,\"\"))","v":0},{"$f":"IF(H13<Control!$D$12,0,IF(H13=Control!$D$12,Flujo!H47,\"\"))","v":0},{"$f":"IF(I13<Control!$D$12,0,IF(I13=Control!$D$12,Flujo!I47,\"\"))","v":0},{"$f":"IF(J13<Control!$D$12,0,IF(J13=Control!$D$12,Flujo!J47,\"\"))","v":0},{"$f":"IF(K13<Control!$D$12,0,IF(K13=Control!$D$12,Flujo!K47,\"\"))","v":0},{"$f":"IF(L13<Control!$D$12,0,IF(L13=Control!$D$12,Flujo!L47,\"\"))","v":0},{"$f":"IF(M13<Control!$D$12,0,IF(M13=Control!$D$12,Flujo!M47,\"\"))","v":0},{"$f":"IF(N13<Control!$D$12,0,IF(N13=Control!$D$12,Flujo!N47,\"\"))","v":12104.819487624929},{"$f":"IF(O13<Control!$D$12,0,IF(O13=Control!$D$12,Flujo!O47,\"\"))","v":""},{"$f":"IF(P13<Control!$D$12,0,IF(P13=Control!$D$12,Flujo!P47,\"\"))","v":""},{"$f":"IF(Q13<Control!$D$12,0,IF(Q13=Control!$D$12,Flujo!Q47,\"\"))","v":""},{"$f":"IF(R13<Control!$D$12,0,IF(R13=Control!$D$12,Flujo!R47,\"\"))","v":""},{"$f":"IF(S13<Control!$D$12,0,IF(S13=Control!$D$12,Flujo!S47,\"\"))","v":""},{"$f":"IF(T13<Control!$D$12,0,IF(T13=Control!$D$12,Flujo!T47,\"\"))","v":""},{"$f":"IF(U13<Control!$D$12,0,IF(U13=Control!$D$12,Flujo!U47,\"\"))","v":""},{"$f":"IF(V13<Control!$D$12,0,IF(V13=Control!$D$12,Flujo!V47,\"\"))","v":""},{"$f":"IF(W13<Control!$D$12,0,IF(W13=Control!$D$12,Flujo!W47,\"\"))","v":""},{"$f":"IF(X13<Control!$D$12,0,IF(X13=Control!$D$12,Flujo!X47,\"\"))","v":""},{"$f":"IF(Y13<Control!$D$12,0,IF(Y13=Control!$D$12,Flujo!Y47,\"\"))","v":""},{"$f":"IF(Z13<Control!$D$12,0,IF(Z13=Control!$D$12,Flujo!Z47,\"\"))","v":""},{"$f":"IF(AA13<Control!$D$12,0,IF(AA13=Control!$D$12,Flujo!AA47,\"\"))","v":""},{"$f":"IF(AB13<Control!$D$12,0,IF(AB13=Control!$D$12,Flujo!AB47,\"\"))","v":""},{"$f":"IF(AC13<Control!$D$12,0,IF(AC13=Control!$D$12,Flujo!AC47,\"\"))","v":""},{"$f":"IF(AD13<Control!$D$12,0,IF(AD13=Control!$D$12,Flujo!AD47,\"\"))","v":""},{"$f":"IF(AE13<Control!$D$12,0,IF(AE13=Control!$D$12,Flujo!AE47,\"\"))","v":""},{"$f":"IF(AF13<Control!$D$12,0,IF(AF13=Control!$D$12,Flujo!AF47,\"\"))","v":""},{"$f":"IF(AG13<Control!$D$12,0,IF(AG13=Control!$D$12,Flujo!AG47,\"\"))","v":""}]
[null,"Activo No Corriente",null,{"$f":"IF(D13<=Control!$D$12,D21-D22,\"\")","v":12435},{"$f":"IF(E13<=Control!$D$12,E21-E22,\"\")","v":41481.5},{"$f":"IF(F13<=Control!$D$12,F21-F22,\"\")","v":141090.44444444444},{"$f":"IF(G13<=Control!$D$12,G21-G22,\"\")","v":123454.13888888889},{"$f":"IF(H13<=Control!$D$12,H21-H22,\"\")","v":105817.83333333334},{"$f":"IF(I13<=Control!$D$12,I21-I22,\"\")","v":88181.527777777781},{"$f":"IF(J13<=Control!$D$12,J21-J22,\"\")","v":70545.222222222219},{"$f":"IF(K13<=Control!$D$12,K21-K22,\"\")","v":52908.916666666657},{"$f":"IF(L13<=Control!$D$12,L21-L22,\"\")","v":35272.611111111095},{"$f":"IF(M13<=Control!$D$12,M21-M22,\"\")","v":17636.305555555533},{"$f":"IF(N13<=Control!$D$12,N21-N22,\"\")","v":-2.9103830456733704E-11},{"$f":"IF(O13<=Control!$D$12,O21-O22,\"\")","v":""},{"$f":"IF(P13<=Control!$D$12,P21-P22,\"\")","v":""},{"$f":"IF(Q13<=Control!$D$12,Q21-Q22,\"\")","v":""},{"$f":"IF(R13<=Control!$D$12,R21-R22,\"\")","v":""},{"$f":"IF(S13<=Control!$D$12,S21-S22,\"\")","v":""},{"$f":"IF(T13<=Control!$D$12,T21-T22,\"\")","v":""},{"$f":"IF(U13<=Control!$D$12,U21-U22,\"\")","v":""},{"$f":"IF(V13<=Control!$D$12,V21-V22,\"\")","v":""},{"$f":"IF(W13<=Control!$D$12,W21-W22,\"\")","v":""},{"$f":"IF(X13<=Control!$D$12,X21-X22,\"\")","v":""},{"$f":"IF(Y13<=Control!$D$12,Y21-Y22,\"\")","v":""},{"$f":"IF(Z13<=Control!$D$12,Z21-Z22,\"\")","v":""},{"$f":"IF(AA13<=Control!$D$12,AA21-AA22,\"\")","v":""},{"$f":"IF(AB13<=Control!$D$12,AB21-AB22,\"\")","v":""},{"$f":"IF(AC13<=Control!$D$12,AC21-AC22,\"\")","v":""},{"$f":"IF(AD13<=Control!$D$12,AD21-AD22,\"\")","v":""},{"$f":"IF(AE13<=Control!$D$12,AE21-AE22,\"\")","v":""},{"$f":"IF(AF13<=Control!$D$12,AF21-AF22,\"\")","v":""},{"$f":"IF(AG13<=Control!$D$12,AG21-AG22,\"\")","v":""}]
{"$rows_left_out":97}
{"sheet":"Resultados","index":2,"n_rows":14,"n_cols":13,"rows_kept":14,"cut":false,"hidden":false,"merged":[[6,8,6,9],[6,5,6,6],[6,2,6,3],[6,11,6,12]]}
[]
[]
[]
[]
[]
[]
[null,null,"Características Proyecto",null,null,"Resultados Financieros (Mill. COP)",null,null,"Proyecto Público de Referencia - PPR",null,null,"Proyecto APP"]
[null,null,"Tipo de Infraestructura",{"$f":"Control!D7","v":"Social"},null,"Pago Inicial",{"$f":"Flujo!H8","v":41970.486868428459},null,"Costos de Inversión",{"$f":"NPV(VLOOKUP(Control!$D$7,Flujo!$B$7:$E$8,4,FALSE),Flujo!D113:I113)+Varios!E54","v":126580.74676230155},null,"Aportes Públicos",{"$f":"NPV(VLOOKUP(Control!$D$7,Flujo!$B$7:$E$8,4,FALSE),Flujo!D116:AG116)","v":0}]
[null,null,"Tipo de Proyecto",{"$f":"Control!D8","v":"Greenfield"},null,"Ingreso Total Requerido",{"$f":"SUM(Flujo!D40:AG40)","v":335763.89494742773},null,"Costos de Explotación",{"$f":"NPV(VLOOKUP(Control!$D$7,Flujo!$B$7:$E$8,4,FALSE),Flujo!D114:AG114)*0.8","v":16906.581159542904},null,"Costos Administración",{"$f":"0.05*J8","v":6329.0373381150785}]
[null,null,"Aprobación Diseños",{"$f":"Control!D9","v":"Si"},null,"Aportes Públicos",{"$f":"G9*Control!D25","v":0},null,"Mantenimientos Mayores",{"$f":"NPV(VLOOKUP(Control!$D$7,Flujo!$B$7:$E$8,4,FALSE),Flujo!D114:AG114)*0.2","v":4226.645289885726},null,"Riesgo Retenido",{"$f":"J12","v":35203.862604102782}]
[null,null,"Etapa Construcción",{"$f":"Control!D10","v":2},null,"Costos y Gastos",{"$f":"SUM(Flujo!D52:AG52,Flujo!D55:AG55,Flujo!D57:AG57,Flujo!D58:AG58)","v":128156.28453510553},null,"Ingresos Terceras Fuentes",{"$f":"NPV(VLOOKUP(Control!$D$7,Flujo!$B$7:$E$8,4,FALSE),Flujo!D115:AG115)","v":211332.2644942865},null,"Costo Ajustado APP",{"$f":"SUM(M8:M10)","v":41532.89994221786}]
[null,null,"Etapa Operativa",{"$f":"Control!D11","v":8},null,"Inversión",{"$f":"SUM(Control!I9:I13)+Control!I17","v":146943},null,"Riesgo Retenido",{"$f":"SUM(Varios!J40:J47)","v":35203.862604102782}]
[null,null,"Total APP",{"$f":"Control!D12","v":11},null,"Deuda Largo Plazo",{"$f":"SUM(Flujo!D63:J63)","v":126592.40914036804},null,"Riesgo Transferido",{"$f":"SUM(Varios!K40:K47)","v":102677.93259529976},null,"Valor por Dinero",{"$f":"J14-M11","v":32730.603974628379}]
[null,null,null,null,null,"Aportes de Capital",{"$f":"SUM(Flujo!D62:AG62)","v":31648.102285092009},null,"Costo Ajustado PPR",{"$f":"J8+J9+J10-J11+J12+J13","v":74263.503916846239}]

{"sheet":"Varios","index":3,"n_rows":54,"n_cols":33,"rows_kept":54,"cut":false,"hidden":true,"merged":[[7,1,11,1],[12,1,15,1],[32,4,32,7],[34,2,37,2]]}
[]
[]
[]
[]
[]
[]
[]
[null,"PPR"," (+) Riesgo Retenido",0,{"$f":"+Resultados!J12","v":35203.862604102782}]
[null,null,"(+) Costo Base",{"$f":"+E8","v":35203.862604102782},{"$f":"+Resultados!J8+Resultados!J9+Resultados!J10","v":147713.97321173019}]
[null,null,"(+) Riesgo Transferido",{"$f":"+D9+E9","v":182917.83581583298},{"$f":"+Resultados!J13","v":102677.93259529976}]
[null,null,"(-) Ingresos de Terceras Fuentes",{"$f":"+E12","v":74263.503916846239},{"$f":"+Resultados!J11","v":211332.2644942865}]
[null,null,{"$f":"+Resultados!I14","v":"Costo Ajustado PPR"},0,{"$f":"+Resultados!J14","v":74263.503916846239}]
[null,"APP",{"$f":"+C8","v":" (+) Riesgo Retenido"},0,{"$f":"+E8","v":35203.862604102782}]
[null,null,"(+) Costos de Administración",{"$f":"+E13","v":35203.862604102782},{"$f":"+Resultados!M9","v":6329.0373381150785}]
[null,null,"(+) Aportes Públicos",{"$f":"+D14+E14","v":41532.89994221786},{"$f":"+Resultados!M8","v":0}]
[null,null,{"$f":"+Resultados!L11","v":"Costo Ajustado APP"},0,{"$f":"+Resultados!M11","v":41532.89994221786}]
[null,"CPP","Valor Por Dinero",{"$f":"+E16","v":41532.89994221786},{"$f":"E12-E16","v":32730.603974628379}]
[]
[]
[]
{"$rows_left_out":35}
{"sheet":"Instructivo","index":4,"n_rows":37,"n_cols":4,"rows_kept":37,"cut":false,"hidden":false,"merged":[[18,2,18,12],[19,3,19,12],[20,3,20,12],[21,3,21,12],[22,3,22,12],[26,3,26,12],[27,3,27,12],[23,3,23,12],[36,3,36,12],[33,3,33,12],[34,3,34,12],[35,3,35,12],[28,3,28,12],[29,3,29,12],[30,3,30,12],[31,3,31,12],[32,3,32,12],[24,3,24,12],[25,3,25,12]]}
[]
[]
[]
[]
[]
[]
[]
[]
[]
[]
[]
[]
[]
[]
[]
[]
[]
[]
[null,null,"HOJA DE CONTROL"]
[null,null,"Tipo de Infraestructura","Dependiendo de su proyecto podrá escoger entre infraestructura productiva (i.e., vías, aeropuertos, ferrocarril, etc) o infraestructura social (i.e., edificación pública, hospitales, colegios, etc.)"]
{"$rows_left_out":17}